{"text_format":"1","workbook":"xlsx","n_sheets":6,"sheets":["Introduction","Price inputs","Results","Calculations 1","Calculations 2","Calculations 3"],"not_rendered":{"charts":0,"images":0,"macros":1,"external_links":0,"defined_names":152,"comments":0,"pivot_tables":0},"unopened":[],"bounds":{"document_bytes":16777216,"sheet_cells":100000,"rows_first":2000,"rows_last":500,"rows_between":2000,"halvings":0,"cell_chars":16384,"cell_head_chars":4096},"cells_cut":0,"cells_raw":0,"read":"whole","date_system":"1900"}

{"sheet":"Introduction","index":0,"n_rows":55,"n_cols":11,"rows_kept":55,"cut":false,"hidden":false,"merged":[[51,2,51,19],[30,3,30,19],[43,2,43,19],[34,2,34,19],[35,2,35,19],[36,3,36,19],[37,3,37,19],[38,3,38,19],[39,3,39,19],[40,3,40,19],[25,3,25,19],[29,3,29,19],[13,2,13,19],[14,3,14,19],[15,3,15,19],[16,3,16,19],[27,3,27,19],[24,3,24,20],[26,3,26,19],[28,3,28,19],[2,2,2,19],[8,2,8,19],[21,3,21,19],[22,3,22,19],[23,3,23,19]]}
[]
[]
[null,null,"Tool to calculate the cost-effective strategy for user-defined prices and cost-effectiveness thresholds"]
[]
[null,null,"For full report on model and analysis see Faria et al. 'Prevention of progression to cirrhosis in hepatitis C with fibrosis: effectiveness and cost-effectiveness of sequential therapy'. 2016"]
[]
[null,null,"Introduction"]
[]
[null,null,"This tool calculates the cost-effective sequence of treatment for patient groups with chronic hepatatis C infection using user-defined prices (or price discounts) and cost-effectiveness threshold. \nHealth benefits are expressed as quality-adjusted life years (QALYs) over the patients' lifetime. Costs are in UK pound sterling. Only costs falling on the NHS budget were included."]
[]
[null,null,"Patient populations"]
[]
[null,null,"The population is patients with chronic hepatitis C infection with advanced fibrosis but pre-cirrhotic (METAVIR F3). "]
[null,null,"The population is divided into 14 subgroups depending on viral genotype, exposure to prior treatment and eligibility to interferon-containing treatments:"]
[null,null,null,"By viral genotype: genotype 1, genotype 2, genotype 3 and genotype 4 virus."]
{"$rows_left_out":41}
{"sheet":"Price inputs","index":1,"n_rows":24,"n_cols":11,"rows_kept":24,"cut":false,"hidden":false,"merged":[[20,4,20,8]]}
[]
[]
[]
[]
[]
[]
[null,null,"Price inputs"]
[]
[null,null,"Generic name","Brand name","Packet size","New price","OR","Discount",null,"UK list price"]
[null,null,"Sofosbuvir","Sovaldi",28,null,null,null,null,11660.98]
[null,null,"Simeprevir","Olysio",7,null,null,null,null,1866.5]
[null,null,"Pegylated interferon","Pegasys 180mcg",1,null,null,null,null,124]
[null,null,"Ribavirin","Copegus",168,null,null,null,null,321.38]
[null,null,"Ledipasvir-Sofosbuvir","Harvoni",28,null,null,null,null,12993.33]
[null,null,"Ombitasvir-paritaprevir-ritonavir","Viekirax",56,null,null,null,null,10733.33]
{"$rows_left_out":10}
{"sheet":"Results","index":2,"n_rows":30,"n_cols":15,"rows_kept":30,"cut":false,"hidden":false,"merged":[[6,3,6,5],[6,6,6,8],[6,9,6,11],[6,14,7,14],[22,14,23,14],[22,3,22,5],[22,6,22,8],[22,9,22,11],[17,2,17,14],[18,2,18,14]]}
[]
[]
[null,null,"Results: Cost-effective strategy for each subgroup"]
[]
[null,null,"Treatment-naïve patients"]
[]
[null,null,null,"Cost-effective strategies",null,null,"% Patients achieving SVR by line",null,null,"Treatment cost by line",null,null,"Total","Total","ICER"]
[null,null,"Subgroup","1st line","2nd line","3rd line","1st ","2nd ","3rd ","1st ","2nd ","3rd ","Costs ","QALYs "]
[null,null,"Genotype 1 interferon ineligible ",{"$f":"IF('Calculations 3'!V11=\"\",\"\",VLOOKUP('Calculations 3'!V11,F3_treat_duration,14,FALSE))","v":"SOF+LED 8w"},{"$f":"IF('Calculations 3'!W11=\"\",\"\",VLOOKUP('Calculations 3'!W11,F3_treat_duration,14,FALSE))","v":"3D+/-RBV 12w"},{"$f":"IF('Calculations 3'!X11=\"\",\"\",VLOOKUP('Calculations 3'!X11,F3_treat_duration,14,FALSE))","v":"SOF+DCV 12w"},{"$f":"'Calculations 3'!AA11","v":0.91891964127642312},{"$f":"'Calculations 3'!AB11","v":5.9627131966183099E-2},{"$f":"'Calculations 3'!AC11","v":2.3030878764844125E-3},{"$f":"'Calculations 3'!AD11","v":25917.98},{"$f":"'Calculations 3'!AE11","v":2229.91},{"$f":"'Calculations 3'!AF11","v":145.08000000000001},{"$f":"'Calculations 3'!AG11","v":29699.8},{"$f":"'Calculations 3'!AH11","v":12.05162912590459},{"$f":"'Calculations 3'!AI11","v":10867.285847714487}]
[null,null,"Genotype 1 interferon eligible",{"$f":"IF('Calculations 3'!V12=\"\",\"\",VLOOKUP('Calculations 3'!V12,F3_treat_duration,14,FALSE))","v":"SOF+LED 8w"},{"$f":"IF('Calculations 3'!W12=\"\",\"\",VLOOKUP('Calculations 3'!W12,F3_treat_duration,14,FALSE))","v":"3D+/-RBV 12w"},{"$f":"IF('Calculations 3'!X12=\"\",\"\",VLOOKUP('Calculations 3'!X12,F3_treat_duration,14,FALSE))","v":"SOF+PR 12w"},{"$f":"'Calculations 3'!AA12","v":0.91896831033393223},{"$f":"'Calculations 3'!AB12","v":5.9600868287588232E-2},{"$f":"'Calculations 3'!AC12","v":1.7412862322704562E-3},{"$f":"'Calculations 3'!AD12","v":25917.98},{"$f":"'Calculations 3'!AE12","v":2228.4299999999998},{"$f":"'Calculations 3'!AF12","v":90.48},{"$f":"'Calculations 3'!AG12","v":29674.57},{"$f":"'Calculations 3'!AH12","v":12.050458913357676},{"$f":"'Calculations 3'!AI12","v":5106.3775698032223}]
[null,null,"Genotype 2 interferon ineligible ",{"$f":"IF('Calculations 3'!V15=\"\",\"\",VLOOKUP('Calculations 3'!V15,F3_treat_duration,14,FALSE))","v":"SOF+RBV 24w"},{"$f":"IF('Calculations 3'!W15=\"\",\"\",VLOOKUP('Calculations 3'!W15,F3_treat_duration,14,FALSE))","v":""},{"$f":"IF('Calculations 3'!X15=\"\",\"\",VLOOKUP('Calculations 3'!X15,F3_treat_duration,14,FALSE))","v":""},{"$f":"'Calculations 3'!AA15","v":0.91025120817728111},{"$f":"'Calculations 3'!AB15","v":0},{"$f":"'Calculations 3'!AC15","v":0},{"$f":"'Calculations 3'!AD15","v":35340.959999999999},{"$f":"'Calculations 3'!AE15","v":0},{"$f":"'Calculations 3'!AF15","v":0},{"$f":"'Calculations 3'!AG15","v":40250.9},{"$f":"'Calculations 3'!AH15","v":11.931257805020184},{"$f":"'Calculations 3'!AI15","v":"Lowest cost"}]
[null,null,"Genotype 2 interferon eligible",{"$f":"IF('Calculations 3'!V16=\"\",\"\",VLOOKUP('Calculations 3'!V16,F3_treat_duration,14,FALSE))","v":"PR 24w"},{"$f":"IF('Calculations 3'!W16=\"\",\"\",VLOOKUP('Calculations 3'!W16,F3_treat_duration,14,FALSE))","v":"SOF+RBV 24w"},{"$f":"IF('Calculations 3'!X16=\"\",\"\",VLOOKUP('Calculations 3'!X16,F3_treat_duration,14,FALSE))","v":""},{"$f":"'Calculations 3'!AA16","v":0.77349890084413542},{"$f":"'Calculations 3'!AB16","v":0.16949954051276978},{"$f":"'Calculations 3'!AC16","v":0},{"$f":"'Calculations 3'!AD16","v":4101.5},{"$f":"'Calculations 3'!AE16","v":6731.12},{"$f":"'Calculations 3'!AF16","v":0},{"$f":"'Calculations 3'!AG16","v":14474.83},{"$f":"'Calculations 3'!AH16","v":11.919411753145216},{"$f":"'Calculations 3'!AI16","v":"Lowest cost"}]
[null,null,"Genotype 3 interferon ineligible ",{"$f":"IF('Calculations 3'!V18=\"\",\"\",VLOOKUP('Calculations 3'!V18,F3_treat_duration,14,FALSE))","v":"SOF+LED+RBV 12w"},{"$f":"IF('Calculations 3'!W18=\"\",\"\",VLOOKUP('Calculations 3'!W18,F3_treat_duration,14,FALSE))","v":"SOF+DCV 12w"},{"$f":"IF('Calculations 3'!X18=\"\",\"\",VLOOKUP('Calculations 3'!X18,F3_treat_duration,14,FALSE))","v":"SOF+RBV 24w"},{"$f":"'Calculations 3'!AA18","v":0.92428132255419326},{"$f":"'Calculations 3'!AB18","v":3.7839689233885761E-2},{"$f":"'Calculations 3'!AC18","v":2.7049620735897059E-3},{"$f":"'Calculations 3'!AD18","v":39355.31},{"$f":"'Calculations 3'!AE18","v":2510.15},{"$f":"'Calculations 3'!AF18","v":238.07},{"$f":"'Calculations 3'!AG18","v":44284.04},{"$f":"'Calculations 3'!AH18","v":11.991200969416449},{"$f":"'Calculations 3'!AI18","v":12188.552170020237}]
[null,null,"Genotype 3 interferon eligible",{"$f":"IF('Calculations 3'!V19=\"\",\"\",VLOOKUP('Calculations 3'!V19,F3_treat_duration,14,FALSE))","v":"PR 24w"},{"$f":"IF('Calculations 3'!W19=\"\",\"\",VLOOKUP('Calculations 3'!W19,F3_treat_duration,14,FALSE))","v":"SOF+PR 12w"},{"$f":"IF('Calculations 3'!X19=\"\",\"\",VLOOKUP('Calculations 3'!X19,F3_treat_duration,14,FALSE))","v":"SOF+LED+RBV 12w"},{"$f":"'Calculations 3'!AA19","v":0.66364328535652339},{"$f":"'Calculations 3'!AB19","v":0.2079105298463122},{"$f":"'Calculations 3'!AC19","v":4.7546110296117897E-2},{"$f":"'Calculations 3'!AD19","v":4099.3900000000003},{"$f":"'Calculations 3'!AE19","v":9469.67},{"$f":"'Calculations 3'!AF19","v":2201.94},{"$f":"'Calculations 3'!AG19","v":20545.39},{"$f":"'Calculations 3'!AH19","v":11.808465176589609},{"$f":"'Calculations 3'!AI19","v":"Lowest cost"}]
[null,null,"Genotype 4 interferon ineligible ",{"$f":"IF('Calculations 3'!V21=\"\",\"\",VLOOKUP('Calculations 3'!V21,F3_treat_duration,14,FALSE))","v":"2D+RBV 12w"},{"$f":"IF('Calculations 3'!W21=\"\",\"\",VLOOKUP('Calculations 3'!W21,F3_treat_duration,14,FALSE))","v":"SOF+LED 12w"},{"$f":"IF('Calculations 3'!X21=\"\",\"\",VLOOKUP('Calculations 3'!X21,F3_treat_duration,14,FALSE))","v":"SOF+DCV 12w"},{"$f":"'Calculations 3'!AA21","v":0.95215737014187274},{"$f":"'Calculations 3'!AB21","v":2.028484047101586E-2},{"$f":"'Calculations 3'!AC21","v":1.1414467368848203E-3},{"$f":"'Calculations 3'!AD21","v":32548.07},{"$f":"'Calculations 3'!AE21","v":850.97},{"$f":"'Calculations 3'!AF21","v":71.66},{"$f":"'Calculations 3'!AG21","v":35300.42},{"$f":"'Calculations 3'!AH21","v":12.018955483877505},{"$f":"'Calculations 3'!AI21","v":9485.524710453943}]
{"$rows_left_out":16}
{"sheet":"Calculations 1","index":3,"n_rows":210,"n_cols":19,"rows_kept":210,"cut":false,"hidden":true,"merged":[[12,9,12,11],[43,16,43,18],[43,4,43,5],[43,10,43,11],[43,12,43,14],[12,3,12,5]]}
[]
[]
[null,null,"Background calculations - part 1"]
[]
[null,null,"This sheet calculates the cost of treatment at the F3 stage, cirrhosis and decompensated cirrhosis using list prices and discounted prices. "]
[]
[]
[]
[null,null,"Costs of treatment at the F3 stage"]
[]
[null,null,"This section calculates the duration of treatment accounting for discontinuations and the cost of treatment under list prices and discounted prices."]
[]
[null,null,null,"List prices",null,null,null,null,null,"Current prices"]
[null,null,"Medication (abbreviated name)","cost 12 weeks","cost/week","unit cost","size","dose","new prices per pack","Current prices","Current prices/week","Over 12 weeks"]
[null,null,"SOF",{"$f":"E15*12","v":34982.94},{"$f":"F15/4","v":2915.2449999999999},11660.98,28,1,{"$f":"IF(sofnew=\"\",IF(sofdis=\"\",\"\",(1-sofdis)*soflist),sofnew)","v":""},{"$f":"IF(I15=\"\",F15,I15)","v":11660.98},{"$f":"J15/G15*H15*7","v":2915.2449999999999},{"$f":"K15*12","v":34982.94}]
{"$rows_left_out":196}
{"sheet":"Calculations 2","index":4,"n_rows":649,"n_cols":49,"rows_kept":649,"cut":false,"hidden":true,"merged":[[14,12,14,19],[14,20,14,28],[14,47,14,48],[14,44,14,46],[13,12,13,19],[14,32,14,34],[14,35,14,37],[14,38,14,40],[14,41,14,43]]}
[]
[]
[]
[null,null,"Background calculations - part 2"]
[]
[null,null,"This sheet calculates the incremental costs, incremental QALYs and ICERs of all strategies for each subgroup. "]
[]
[null,null,"Parameters required for the macro to calculate the cost-effective strategies:"]
[]
[null,null,null,"N.comparators",{"$f":"COUNT(D17:D649)","v":633},null,"N.TN",{"$f":"COUNTIF(F17:F649,0)","v":518}]
[]
[null,null,null,"N.subgroups",{"$f":"SUM(1/COUNTIF(C17:C649,C17:C649))","v":13.999999999999979},null,"N.results",{"$f":"COUNT(M17:AE17)","v":19}]
[]
[]
[null,null,null,null,null,null,null,null,null,null,null,null,"Costs",null,null,null,null,null,null,null,"Proportion of patients by outcome",null,null,null,null,null,null,null,null,null,null,null,"F3 treatment 1st line",null,null,"F3 treatment 2nd line",null,null,"F3 treatment 3rd line",null,null,"Cirrhosis treatment",null,null,"Decompensated cirrhosis treatment",null,null,"Results"]
{"$rows_left_out":635}
{"sheet":"Calculations 3","index":5,"n_rows":406,"n_cols":35,"rows_kept":406,"cut":false,"hidden":true,"merged":[[8,2,8,17],[8,34,9,34],[8,21,8,23],[8,26,8,28],[8,29,8,31],[8,32,9,32],[8,33,9,33],[9,15,10,15],[9,16,10,16],[9,17,10,17],[9,4,9,8],[8,19,9,19],[8,20,9,20]]}
[]
[]
[null,null,"Background calculations - part 3"]
[]
[null,null,"This sheet extracts the strategies in the cost-effectiveness frontier from the 'results' sheet. It also creates a table with the cost-effective strategy for each subgroup for a given threshold."]
[]
[null,null,null,null,null,null,null,null,null,null,null,null,null,null,null,null,null,null,null,null,null,1,2,3,4,5,6,7,8,9,10,11,12,13,14]
[]
[null,null,"Strategies in the cost-effectiveness frontier per subgroup",null,null,null,null,null,null,null,null,null,null,null,null,null,null,null,null,"Subgroup","Net benefit","Cost-effective strategies",null,null,null,null,"SVR rate",null,null,"Treatment cost",null,null,"Total costs","Total QALYs","ICER"]
[null,null,null,"Subgroup","Treatments",null,null,null,null,"SVR rate",null,null,"Treatment cost",null,null,"Total costs","Total QALYs","ICER",null,null,null,{"$f":"E11","v":"1st line"},"2nd line","3rd line","Cirrhosis","Decompensated cirrhosis","1st line","2nd line","3rd line","1st line","2nd line","3rd line"]
[null,null,"Net benefit",null,"1st line","2nd line","3rd line","Cirrhosis","Decompensated cirrhosis","1st line","2nd line","3rd line","1st line","2nd line","3rd line",null,null,null,null,100,{"$f":"MAX(IF($D$12:$D$406=T11,$C$12:$C$406))","v":211332.78251860649},{"$f":"IF(VLOOKUP($U11,$C$12:$R$406,V$7+2,FALSE)=\"\",\"\",VLOOKUP($U11,$C$12:$R$406,V$7+2,FALSE))","v":"G1_TN III_SOF+LED8"},"G1_TE III_3D+/-R12","G1_TE III_SOF+DCV12","G1 TE III_F4SVR","DC_SVRG1",{"$f":"IF(VLOOKUP($U11,$C$12:$R$406,AA$7+2,FALSE)=\"\",\"\",VLOOKUP($U11,$C$12:$R$406,AA$7+2,FALSE))","v":0.91891964127642312},5.9627131966183099E-2,2.3030878764844125E-3,25917.98,2229.91,145.08000000000001,29699.8,12.05162912590459,{"$f":"IF(VLOOKUP($U11,$C$12:$R$406,AI$7+2,FALSE)=0,\"Lowest cost\",VLOOKUP($U11,$C$12:$R$406,AI$7+2,FALSE))","v":10867.285847714487}]
[null,null,{"$f":"Q12*threshold-P12+RAND()/1000000","v":211299.84951258308},100,"G1_TN III_SOF+LED8","G1_TE III_3D+/-R12",null,"G1 TE III_F4SVR","DC_SVRG1",0.91891964127642312,5.9627131966183099E-2,0,25917.98,2229.91,0,29660.6,12.048022475582767,0,null,110,{"$f":"MAX(IF($D$12:$D$406=T12,$C$12:$C$406))","v":211334.60826812094},"G1_TN IE_SOF+LED8","G1_TE IE_3D+/-R12","G1_TE IE_SOF+PR12","G1 TE IE_F4SVR","DC_SVRG1",0.91896831033393223,5.9600868287588232E-2,1.7412862322704562E-3,25917.98,2228.4299999999998,90.48,29674.57,12.050458913357676,{"$f":"IF(VLOOKUP($U12,$C$12:$R$406,AI$7+2,FALSE)=0,\"Lowest cost\",VLOOKUP($U12,$C$12:$R$406,AI$7+2,FALSE))","v":5106.3775698032223}]
[null,null,211332.78251860649,100,"G1_TN III_SOF+LED8","G1_TE III_3D+/-R12","G1_TE III_SOF+DCV12","G1 TE III_F4SVR","DC_SVRG1",0.91891964127642312,5.9627131966183099E-2,2.3030878764844125E-3,25917.98,2229.91,145.08000000000001,29699.8,12.05162912590459,10867.285847714487,null,111,{"$f":"MAX(IF($D$12:$D$406=T13,$C$12:$C$406))","v":203330.14145980333},"G1_TN IE_PR48","G1_TE IE_3D+/-R12","G1_TE IE_SOF+LED12","G1 TE IE_F4SVR","DC_SVRG1",0.40502478376210033,0.46998102456121843,1.7755117074518736E-2,6109.6,17067.96,719.3,31011.31,11.717072572987913,"Lowest cost"]
[null,null,211300.40825197689,110,"G1_TN IE_SOF+LED8","G1_TE IE_3D+/-R12","G1_TE IE_PR48","G1 TE IE_F4SVR","DC_SVRG1",0.91896831033393223,5.9600868287588232E-2,4.3276439622696598E-4,25917.98,2228.4299999999998,15.2,29662.84,12.048162412591783,0,null,112,{"$f":"MAX(IF($D$12:$D$406=T14,$C$12:$C$406))","v":201622.79504190717},"G1_TN IE_SMV+PR12+24","G1_TE IE_3D+/-R12","G1_TE IE_SOF+LED12","G1 TE IE_F4SVR","DC_SVRG1",0.7553083472103661,0.18256591315074505,6.8945470139136359E-3,25929.42,6745.58,284.16000000000003,36397.040000000001,11.900991752062538,"Lowest cost"]
[null,null,211334.60826812094,110,"G1_TN IE_SOF+LED8","G1_TE IE_3D+/-R12","G1_TE IE_SOF+PR12","G1 TE IE_F4SVR","DC_SVRG1",0.91896831033393223,5.9600868287588232E-2,1.7412862322704562E-3,25917.98,2228.4299999999998,90.48,29674.57,12.050458913357676,5106.3775698032223,null,200,{"$f":"MAX(IF($D$12:$D$406=T15,$C$12:$C$406))","v":198374.25610105143},"G2_TN III_SOF+RBV12","","","G3 TE IE_F4SVR","DC_SVRG3",0.91025120817728111,0,0,35340.959999999999,0,0,40250.9,11.931257805020184,"Lowest cost"]
{"$rows_left_out":391}